BDBM280277 US10029993, Example 40
SMILES CN([C@H]1CC[C@@H](CC1)NC(=O)CN1CCN(CC1)c1nncc(n1)-c1ccc(F)cc1)C(C)=O
InChI Key InChIKey=AYIFIVCOWKZTTA-MEMLXQNLSA-N
Data  1 IC50
  Tab Delimited (TSV)   2D SDfile   Computed 3D by Vconf -m prep SDfile
Find this compound or compounds like it in BindingDB:
Activity Spreadsheet -- Enzyme Inhibition Constant Data from BindingDB
Found 1 hit for monomerid = 280277
TargetCytochrome P450 11B2, mitochondrial(Homo sapiens (Human))
Mitsubishi Tanabe Pharma
US Patent
LigandPNGBDBM280277(US10029993, Example 40)
Affinity DataIC50:  4.90nMpH: 7.4 T: 2°C. Assay description: The pcDNA3.1-human CYP11B2 plasmid was transfected into a Chinese hamster lung fibroblast V79 cell line to produce a cell line stably expressing huma...
Ligand InfoPC cidPC sid
In DepthDetails US Patent