BDBM280293 US10029993, Example 82
SMILES CN1CCNC(=O)[C@@]11CCC(CC1)NC(=O)CN1CCN(CC1)c1nncc(n1)-c1ccc(F)cc1
InChI Key InChIKey=GVYJRTHHNRUQHS-QWYQCIMWSA-N
Data  1 IC50
  Tab Delimited (TSV)   2D SDfile   Computed 3D by Vconf -m prep SDfile
Find this compound or compounds like it in BindingDB:
Activity Spreadsheet -- Enzyme Inhibition Constant Data from BindingDB
Found 1 hit for monomerid = 280293
TargetCytochrome P450 11B2, mitochondrial(Homo sapiens (Human))
Mitsubishi Tanabe Pharma
US Patent
LigandPNGBDBM280293(US10029993, Example 82)
Affinity DataIC50:  12nMpH: 7.4 T: 2°C. Assay description: The pcDNA3.1-human CYP11B2 plasmid was transfected into a Chinese hamster lung fibroblast V79 cell line to produce a cell line stably expressing huma...
Ligand InfoPC cidPC sid
In DepthDetails US Patent