BDBM280319 US10029993, Example 196
SMILES CC(=O)N1CCC(CNc2nncc(n2)-c2ccc3ccccc3c2)CC1
InChI Key InChIKey=FMELDLULKKNJMH-UHFFFAOYSA-N
Data  1 IC50
  Tab Delimited (TSV)   2D SDfile   Computed 3D by Vconf -m prep SDfile
Find this compound or compounds like it in BindingDB:
Activity Spreadsheet -- Enzyme Inhibition Constant Data from BindingDB
Found 1 hit for monomerid = 280319
TargetCytochrome P450 11B2, mitochondrial(Homo sapiens (Human))
Mitsubishi Tanabe Pharma
US Patent
LigandPNGBDBM280319(US10029993, Example 196)
Affinity DataIC50:  67nMpH: 7.4 T: 2°C. Assay description: The pcDNA3.1-human CYP11B2 plasmid was transfected into a Chinese hamster lung fibroblast V79 cell line to produce a cell line stably expressing huma...
Ligand InfoPC cidPC sid
In DepthDetails US Patent