BDBM280372 US10030012, Example 2::ethyl 4-(4-{1- [(cyclohexyl- carbamoyl) methyl]- 1H-imidazol-2- yl}piperidin-1- yl)azepane-1- carboxylate
SMILES CCOC(=O)N1CCCC(CC1)N1CCC(CC1)c1nccn1CC(=O)NC1CCCCC1
InChI Key InChIKey=KTUOJTRXBZZDGS-UHFFFAOYSA-N
Data  1 EC50
  Tab Delimited (TSV)   2D SDfile   Computed 3D by Vconf -m prep SDfile
Find this compound or compounds like it in BindingDB:
Activity Spreadsheet -- Enzyme Inhibition Constant Data from BindingDB
Found 1 hit for monomerid = 280372
TargetMuscarinic acetylcholine receptor M4(Homo sapiens (Human))
Heptares Therapeutics
US Patent
LigandPNGBDBM280372(US10030012, Example 2 | ethyl 4-(4-{1- [(cyclohexy...)
Affinity DataEC50:  1.87E+3nM. Assay description: The functional activity of compounds at the M4 and M2 receptors was determined by measuring changes in the level of intracellular calcium ions caused...
Ligand InfoPC cidPC sid
In DepthDetails US Patent