BDBM280417 US10030012, Example 47::ethyl 4-[4-(2- ethoxy-5-methyl- pyridin-3- yl)piperidin-1- yl]piperidine-1- carboxylate
SMILES CCOC(=O)N1CCC(CC1)N1CCC(CC1)c1cc(C)cnc1OCC
InChI Key InChIKey=BAJUPSPMMPKZKL-UHFFFAOYSA-N
Data  1 EC50
  Tab Delimited (TSV)   2D SDfile   Computed 3D by Vconf -m prep SDfile
Find this compound or compounds like it in BindingDB:
Activity Spreadsheet -- Enzyme Inhibition Constant Data from BindingDB
Found 1 hit for monomerid = 280417
TargetMuscarinic acetylcholine receptor M4(Homo sapiens (Human))
Heptares Therapeutics
US Patent
LigandPNGBDBM280417(US10030012, Example 47 | ethyl 4-[4-(2- ethoxy-5-m...)
Affinity DataEC50:  160nM. Assay description: The functional activity of compounds at the M4 and M2 receptors was determined by measuring changes in the level of intracellular calcium ions caused...
Ligand InfoPC cidPC sid
In DepthDetails US Patent