BDBM280665 US10030020, Example 214::US10781211, Example 214
SMILES OC(=O)[C@@H]1CCCN(C1)c1cc(ccc1CN1CCCC11CCN(CC1)C(=O)OC(C(F)(F)F)C(F)(F)F)C(F)(F)F
InChI Key InChIKey=RVKFVONCQKHWPP-QGZVFWFLSA-N
Data  2 IC50
  Tab Delimited (TSV)   2D SDfile   Computed 3D by Vconf -m prep SDfile
Find this compound or compounds like it in BindingDB:
Activity Spreadsheet -- Enzyme Inhibition Constant Data from BindingDB
Found 2 hits for monomerid = 280665
TargetMonoglyceride lipase(Homo sapiens (Human))
Lundbeck La Jolla Research Center
US Patent
LigandPNGBDBM280665(US10030020, Example 214 | US10781211, Example 214)
Affinity DataIC50: <100nM. Assay description: Human: Proteomes (human prefrontal cortex or cell membrane fractions) (50 μL, 1.0-2.0 mg/mL total protein concentration) were preincubated with ...
Ligand InfoPC cidPC sid
In DepthDetails US Patent
TargetMonoglyceride lipase(Homo sapiens (Human))
Lundbeck La Jolla Research Center
US Patent
LigandPNGBDBM280665(US10030020, Example 214 | US10781211, Example 214)
Affinity DataIC50: <100nMT: 2°C. Assay description: Proteomes (human prefrontal cortex or cell membrane fractions) (50 μL, 1.0-2.0 mg/mL total protein concentration) were preincubated with varying...
Ligand InfoPC cidPC sid
In DepthDetails US Patent