BDBM280728 US10030026, Compound C-7
SMILES FCc1ccc(nc1)C(F)(F)CN1CCC(CC1)Nc1ncnc2[nH]ncc12
InChI Key InChIKey=PNIKLLKRPDNOGI-UHFFFAOYSA-N
Data  2 IC50
  Tab Delimited (TSV)   2D SDfile   Computed 3D by Vconf -m prep SDfile
Find this compound or compounds like it in BindingDB:
Activity Spreadsheet -- Enzyme Inhibition Constant Data from BindingDB
Found 2 hits for monomerid = 280728
TargetGlutamate receptor ionotropic, NMDA 2B(Homo sapiens (Human))
Rugen Holdings (Cayman)
US Patent
LigandPNGBDBM280728(US10030026, Compound C-7)
Affinity DataIC50: >1.00E+7nM
Ligand InfoPC cidPC sid
In DepthDetails US Patent
TargetGlutamate receptor ionotropic, NMDA 2B(Homo sapiens (Human))
Rugen Holdings (Cayman)
US Patent
LigandPNGBDBM280728(US10030026, Compound C-7)
Affinity DataIC50:  43nMT: 2°C. Assay description: HEK293 cell lines stably expressing cloned human NR1/NR2B and NR1/NR2A, respectively, were established according to standard previously described met...
Ligand InfoPC cidPC sid
In DepthDetails US Patent