BDBM281109 US10022354, Example 49
SMILES Cc1cc(cc(n1)C1CCN(C1)C(=O)c1cc(n[nH]1)-c1ccccc1)-c1cnn(C)c1
InChI Key InChIKey=LDYQBUHJTBTAKO-UHFFFAOYSA-N
Data  1 IC50
  Tab Delimited (TSV)   2D SDfile   Computed 3D by Vconf -m prep SDfile
Find this compound or compounds like it in BindingDB:
Activity Spreadsheet -- Enzyme Inhibition Constant Data from BindingDB
Found 1 hit for monomerid = 281109
TargetLysine-specific demethylase 5A(Homo sapiens (Human))
Genentech
US Patent
LigandPNGBDBM281109(US10022354, Example 49)
Affinity DataIC50:  3.60nMpH: 7.0 T: 2°C. Assay description: Full length KDM5A enzyme was expressed and purified inhouse. Biotin-H3K4me3 peptide was purchased from New England Biolabs. HTRF reagents (containing...
Ligand InfoPC cidPC sid
In DepthDetails US Patent