BDBM281122 US10022354, Example 62
SMILES COc1cccc(c1)-c1cc(C)nc(c1)C1CCN(C1)C(=O)c1cc(n[nH]1)C(C)C
InChI Key InChIKey=AMWGJZWBMJNXFP-UHFFFAOYSA-N
Data  1 IC50
  Tab Delimited (TSV)   2D SDfile   Computed 3D by Vconf -m prep SDfile
Find this compound or compounds like it in BindingDB:
Activity Spreadsheet -- Enzyme Inhibition Constant Data from BindingDB
Found 1 hit for monomerid = 281122
TargetLysine-specific demethylase 5A(Homo sapiens (Human))
Genentech
US Patent
LigandPNGBDBM281122(US10022354, Example 62)
Affinity DataIC50:  0.220nMpH: 7.0 T: 2°C. Assay description: Full length KDM5A enzyme was expressed and purified inhouse. Biotin-H3K4me3 peptide was purchased from New England Biolabs. HTRF reagents (containing...
Ligand InfoPC cidPC sid
In DepthDetails US Patent