BDBM281123 US10022354, Example 63
SMILES CC(C)c1cc([nH]n1)C(=O)N1CCC(C1)c1cc(cc(C)n1)-c1ccn[nH]1
InChI Key InChIKey=KYAHWPYRFJRPDO-UHFFFAOYSA-N
Data  1 IC50
  Tab Delimited (TSV)   2D SDfile   Computed 3D by Vconf -m prep SDfile
Find this compound or compounds like it in BindingDB:
Activity Spreadsheet -- Enzyme Inhibition Constant Data from BindingDB
Found 1 hit for monomerid = 281123
TargetLysine-specific demethylase 5A(Homo sapiens (Human))
Genentech
US Patent
LigandPNGBDBM281123(US10022354, Example 63)
Affinity DataIC50:  0.350nMpH: 7.0 T: 2°C. Assay description: Full length KDM5A enzyme was expressed and purified inhouse. Biotin-H3K4me3 peptide was purchased from New England Biolabs. HTRF reagents (containing...
Ligand InfoPC cidPC sid
In DepthDetails US Patent