BDBM281424 4-({2-[ethyl(methyl-sulfonyl)amino]benzyl}amino)-6-[5-fluoro-4-hydroxy-2-(2,2,2-trifluoroethyl)phenyl]-1H-pyrazolo[4,3-c]pyridine-3-carboxamide::US10022376, Example 90
SMILES CCN(c1ccccc1CNc1nc(cc2[nH]nc(C(N)=O)c12)-c1cc(F)c(O)cc1CC(F)(F)F)S(C)(=O)=O
InChI Key InChIKey=ZEPIDCBLPYNVQL-UHFFFAOYSA-N
Data  8 IC50
  Tab Delimited (TSV)   2D SDfile   Computed 3D by Vconf -m prep SDfile
Find this compound or compounds like it in BindingDB:
Activity Spreadsheet -- Enzyme Inhibition Constant Data from BindingDB
Found 8 hits for monomerid = 281424
TargetTyrosine-protein kinase JAK1(Homo sapiens (Human))
Pfizer
US Patent
LigandPNGBDBM281424(4-({2-[ethyl(methyl-sulfonyl)amino]benzyl}amino)-6...)
Affinity DataIC50:  2.70nMpH: 7.4 T: 2°C. Assay description: Test article was solubilized in dimethyl sulfoxide (DMSO) to a stock concentration of 30 mM. An 11-point half log dilution series was created in DMSO...
Ligand InfoPC cidPC sid
In DepthDetails US Patent
TargetTyrosine-protein kinase JAK2(Homo sapiens (Human))
Pfizer
US Patent
LigandPNGBDBM281424(4-({2-[ethyl(methyl-sulfonyl)amino]benzyl}amino)-6...)
Affinity DataIC50:  18.1nMpH: 7.4 T: 2°C. Assay description: Test article was solubilized in dimethyl sulfoxide (DMSO) to a stock concentration of 30 mM. An 11-point half log dilution series was created in DMSO...
Ligand InfoPC cidPC sid
In DepthDetails US Patent
TargetTyrosine-protein kinase JAK3(Homo sapiens (Human))
Pfizer
US Patent
LigandPNGBDBM281424(4-({2-[ethyl(methyl-sulfonyl)amino]benzyl}amino)-6...)
Affinity DataIC50:  77.1nMpH: 7.4 T: 2°C. Assay description: Test article was solubilized in dimethyl sulfoxide (DMSO) to a stock concentration of 30 mM. An 11-point half log dilution series was created in DMSO...
Ligand InfoPC cidPC sid
In DepthDetails US Patent
TargetNon-receptor tyrosine-protein kinase TYK2(Homo sapiens (Human))
Pfizer
US Patent
LigandPNGBDBM281424(4-({2-[ethyl(methyl-sulfonyl)amino]benzyl}amino)-6...)
Affinity DataIC50:  23.2nMpH: 7.4 T: 2°C. Assay description: Test article was solubilized in dimethyl sulfoxide (DMSO) to a stock concentration of 30 mM. An 11-point half log dilution series was created in DMSO...
Ligand InfoPC cidPC sid
In DepthDetails US Patent
TargetTyrosine-protein kinase JAK1(Homo sapiens (Human))
Pfizer
US Patent
LigandPNGBDBM281424(4-({2-[ethyl(methyl-sulfonyl)amino]benzyl}amino)-6...)
Affinity DataIC50:  2.70nMpH: 7.4 T: 2°C. Assay description: Test article was solubilized in dimethyl sulfoxide (DMSO) to a stock concentration of 30 mM. An 11-point half log dilution series was created in DMSO...
Ligand InfoPC cidPC sid
In DepthDetails US Patent
TargetTyrosine-protein kinase JAK2(Homo sapiens (Human))
Pfizer
US Patent
LigandPNGBDBM281424(4-({2-[ethyl(methyl-sulfonyl)amino]benzyl}amino)-6...)
Affinity DataIC50:  18.1nMpH: 7.4 T: 2°C. Assay description: Test article was solubilized in dimethyl sulfoxide (DMSO) to a stock concentration of 30 mM. An 11-point half log dilution series was created in DMSO...
Ligand InfoPC cidPC sid
In DepthDetails US Patent
TargetTyrosine-protein kinase JAK3(Homo sapiens (Human))
Pfizer
US Patent
LigandPNGBDBM281424(4-({2-[ethyl(methyl-sulfonyl)amino]benzyl}amino)-6...)
Affinity DataIC50:  77.1nMpH: 7.4 T: 2°C. Assay description: Test article was solubilized in dimethyl sulfoxide (DMSO) to a stock concentration of 30 mM. An 11-point half log dilution series was created in DMSO...
Ligand InfoPC cidPC sid
In DepthDetails US Patent
TargetNon-receptor tyrosine-protein kinase TYK2(Homo sapiens (Human))
Pfizer
US Patent
LigandPNGBDBM281424(4-({2-[ethyl(methyl-sulfonyl)amino]benzyl}amino)-6...)
Affinity DataIC50:  23.2nMpH: 7.4 T: 2°C. Assay description: Test article was solubilized in dimethyl sulfoxide (DMSO) to a stock concentration of 30 mM. An 11-point half log dilution series was created in DMSO...
Ligand InfoPC cidPC sid
In DepthDetails US Patent