BDBM28151 5-[(S)-(benzenesulfonyl)[(2R)-7-chloro-1H,2H,3H,4H-cyclopenta[b]indol-2-yl]fluoromethyl]-N,N-dimethyl-1,3,4-oxadiazol-2-amine::tetrahydro-cyclopenta[b]indole, (+/-)27d
SMILES [H][C@@]1(Cc2[nH]c3ccc(Cl)cc3c2C1)[C@@](F)(c1nnc(o1)N(C)C)S(=O)(=O)c1ccccc1
InChI Key InChIKey=IPFQNBHHJCPINI-DMZKTXOQSA-N
Data  2 IC50  2 EC50
  Tab Delimited (TSV)   2D SDfile   Computed 3D by Vconf -m prep SDfile
Find this compound or compounds like it in BindingDB:
Activity Spreadsheet -- Enzyme Inhibition Constant Data from BindingDB
Found 2 hits for monomerid = 28151
TargetOxysterols receptor LXR-beta(Homo sapiens (Human))
F. Hoffmann-La Roche
LigandPNGBDBM28151(5-[(S)-(benzenesulfonyl)[(2R)-7-chloro-1H,2H,3H,4H...)
Affinity DataIC50:  150nM EC50:  76nM. Assay description: LXR receptor binding assays were performed in 96-well plates. For each well reaction, GST-LXR-LBD fusion proteins were bound to SPA beads, and radiol...
In DepthDetails ArticlePubMed
TargetOxysterols receptor LXR-alpha(Homo sapiens (Human))
F. Hoffmann-La Roche
LigandPNGBDBM28151(5-[(S)-(benzenesulfonyl)[(2R)-7-chloro-1H,2H,3H,4H...)
Affinity DataIC50:  300nM EC50:  890nMpH: 7.4 T: 2°C. Assay description: LXR receptor binding assays were performed in 96-well plates. For each well reaction, GST-LXR-LBD fusion proteins were bound to SPA beads, and radiol...
In DepthDetails ArticlePubMed