BDBM281608 US10022461, Compound 58
SMILES Cn1cc(cn1)-c1ccc(nc1)-n1ccc2ccncc12
InChI Key InChIKey=VJIHHECCFCOPPP-UHFFFAOYSA-N
Data  1 KI
  Tab Delimited (TSV)   2D SDfile   Computed 3D by Vconf -m prep SDfile
Find this compound or compounds like it in BindingDB:
Activity Spreadsheet -- Enzyme Inhibition Constant Data from BindingDB
Found 1 hit for monomerid = 281608
TargetMicrotubule-associated protein tau(Homo sapiens (Human))
Merck Sharp & Dohme
US Patent
LigandPNGBDBM281608(US10022461, Compound 58)
Affinity DataKi:  1.32nM ΔG°:  -12.1kcal/molepH: 7.4 T: 2°C. Assay description: For displacement tau binding assay, unlabeled test compounds were dissolved in DMSO at 1 mM. Dilutions of tests compounds to various concentrations w...
Ligand InfoPC cidPC sid
In DepthDetails US Patent