BDBM281615 US10022461, Compound 65
SMILES Cn1cnc(c1)-c1ccc(nc1)-n1ccc2ccncc12
InChI Key InChIKey=LCVDSOHRDBUFPF-UHFFFAOYSA-N
Data  1 KI
  Tab Delimited (TSV)   2D SDfile   Computed 3D by Vconf -m prep SDfile
Find this compound or compounds like it in BindingDB:
Activity Spreadsheet -- Enzyme Inhibition Constant Data from BindingDB
Found 1 hit for monomerid = 281615
TargetMicrotubule-associated protein tau(Homo sapiens (Human))
Merck Sharp & Dohme
US Patent
LigandPNGBDBM281615(US10022461, Compound 65)
Affinity DataKi:  3.42nM ΔG°:  -11.5kcal/molepH: 7.4 T: 2°C. Assay description: For displacement tau binding assay, unlabeled test compounds were dissolved in DMSO at 1 mM. Dilutions of tests compounds to various concentrations w...
Ligand InfoPC cidPC sid
In DepthDetails US Patent