BDBM28167 5-(1H-1,3-benzodiazol-1-yl)-3-[(2-fluorophenyl)methoxy]thiophene-2-carboxamide::benzimidazole thiophene analogue, 18
SMILES NC(=O)c1sc(cc1OCc1ccccc1F)-n1cnc2ccccc12
InChI Key InChIKey=QBUKWINFURUTNN-UHFFFAOYSA-N
Data  1 IC50
  Tab Delimited (TSV)   2D SDfile   Computed 3D by Vconf -m prep SDfile
Find this compound or compounds like it in BindingDB:
Activity Spreadsheet -- Enzyme Inhibition Constant Data from BindingDB
Found 1 hit for monomerid = 28167
TargetSerine/threonine-protein kinase PLK1(Homo sapiens (Human))
Gsk
LigandPNGBDBM28167(5-(1H-1,3-benzodiazol-1-yl)-3-[(2-fluorophenyl)met...)
Affinity DataIC50:  14nMpH: 7.2 T: 2°C. Assay description: The compound inhibitory activity was determined by incubation with purified PLK enzyme and biotinylated peptide substrate in the presence ATP/[gamma-...
In DepthDetails ArticlePubMed