BDBM281681 US10023519, Example 22
SMILES OC(=O)CO[C@H]1C[C@H](C1)c1ccc(cc1)-c1cc(Oc2cccc(F)c2)cnc1Cl
InChI Key InChIKey=DBXZWWPONFLMDK-UWUNEBHHSA-N
Data  1 EC50
  Tab Delimited (TSV)   2D SDfile   Computed 3D by Vconf -m prep SDfile
Find this compound or compounds like it in BindingDB:
Activity Spreadsheet -- Enzyme Inhibition Constant Data from BindingDB
Found 1 hit for monomerid = 281681
TargetProbable G-protein coupled receptor 160(Homo sapiens (Human))
Bristol-Myers Squibb
US Patent
LigandPNGBDBM281681(US10023519, Example 22)
Affinity DataEC50:  360nMT: 2°C. Assay description: The human and mouse GPR120-mediated intracellular phosphorylated ERK assays were established using CHOA12 cells stably transfected with the short for...
Ligand InfoPC cidPC sid
In DepthDetails US Patent