BDBM281692 Cis-2-(3-(5′-(cyclohexyloxy)-2′-fluoro-[1,1′-biphenyl]-4-yl)cyclobutoxy)acetic acid::US10023519, Example 33
SMILES OC(=O)COC1CC(C1)c1ccc(cc1)-c1cc(OC2CCCCC2)ccc1F
InChI Key InChIKey=KQBRPXCRZZLUCP-UHFFFAOYSA-N
Data  1 EC50
  Tab Delimited (TSV)   2D SDfile   Computed 3D by Vconf -m prep SDfile
Find this compound or compounds like it in BindingDB:
Activity Spreadsheet -- Enzyme Inhibition Constant Data from BindingDB
Found 1 hit for monomerid = 281692
TargetProbable G-protein coupled receptor 160(Homo sapiens (Human))
Bristol-Myers Squibb
US Patent
LigandPNGBDBM281692(Cis-2-(3-(5′-(cyclohexyloxy)-2′-fluoro...)
Affinity DataEC50:  760nMT: 2°C. Assay description: The human and mouse GPR120-mediated intracellular phosphorylated ERK assays were established using CHOA12 cells stably transfected with the short for...
Ligand InfoPC cidPC sid
In DepthDetails US Patent