BDBM281712 4-(Cis-3-(3-phenoxybenzyloxy)cyclobutyl)butanoic acid::US10023519, Example 53
SMILES OC(=O)CCC[C@H]1C[C@H](C1)OCc1cccc(Oc2ccccc2)c1
InChI Key InChIKey=GTINCJIAFANFAU-MOBUCQHHSA-N
Data  1 EC50
  Tab Delimited (TSV)   2D SDfile   Computed 3D by Vconf -m prep SDfile
Find this compound or compounds like it in BindingDB:
Activity Spreadsheet -- Enzyme Inhibition Constant Data from BindingDB
Found 1 hit for monomerid = 281712
TargetProbable G-protein coupled receptor 160(Homo sapiens (Human))
Bristol-Myers Squibb
US Patent
LigandPNGBDBM281712(4-(Cis-3-(3-phenoxybenzyloxy)cyclobutyl)butanoic a...)
Affinity DataEC50:  430nMT: 2°C. Assay description: The human and mouse GPR120-mediated intracellular phosphorylated ERK assays were established using CHOA12 cells stably transfected with the short for...
Ligand InfoPC cidPC sid
In DepthDetails US Patent