BDBM281726 Cis-2-(3-((2′-fluoro-5′-phenoxy-[1,1′-biphenyl]-4-yl)oxy)cyclobutyl)acetic acid::US10023519, Example 67
SMILES OC(=O)C[C@H]1C[C@H](C1)Oc1ccc(cc1)-c1cc(Oc2ccccc2)ccc1F
InChI Key InChIKey=ROJQGCSZOVLBEA-NBEIKUQISA-N
Data  1 EC50
  Tab Delimited (TSV)   2D SDfile   Computed 3D by Vconf -m prep SDfile
Find this compound or compounds like it in BindingDB:
Activity Spreadsheet -- Enzyme Inhibition Constant Data from BindingDB
Found 1 hit for monomerid = 281726
TargetProbable G-protein coupled receptor 160(Homo sapiens (Human))
Bristol-Myers Squibb
US Patent
LigandPNGBDBM281726(Cis-2-(3-((2′-fluoro-5′-phenoxy-[1,1&#...)
Affinity DataEC50:  330nMT: 2°C. Assay description: The human and mouse GPR120-mediated intracellular phosphorylated ERK assays were established using CHOA12 cells stably transfected with the short for...
Ligand InfoPC cidPC sid
In DepthDetails US Patent