BDBM282380 2-(4-(3-amino-1H-pyrazolo[3,4-b]pyridin-5-yl)benzylamino)-N-cyclopropyl-5-(trifluoromethyl)nicotinamide::US10030016, Example 260
SMILES Nc1n[nH]c2ncc(cc12)-c1ccc(CNc2ncc(cc2C(=O)NC2CC2)C(F)(F)F)cc1
InChI Key InChIKey=QCSMFHNFWIJMIQ-UHFFFAOYSA-N
Data  1 IC50
  Tab Delimited (TSV)   2D SDfile   Computed 3D by Vconf -m prep SDfile
Find this compound or compounds like it in BindingDB:
Activity Spreadsheet -- Enzyme Inhibition Constant Data from BindingDB
Found 1 hit for monomerid = 282380
Target3-phosphoinositide-dependent protein kinase 1 [51-359](Homo sapiens (Human))
Sunesis Pharmaceuticals
US Patent
LigandPNGBDBM282380(2-(4-(3-amino-1H-pyrazolo[3,4-b]pyridin-5-yl)benzy...)
Affinity DataIC50:  550nM. Assay description: PDK1 (amino acids 51-359) and AKT2 (amino acids 140-467 fused to PIFtide, amino acids EEQEMFRDFDYIADW) were expressed as N-terminally tagged GST fusi...
Ligand InfoPC cidPC sid
In DepthDetails US Patent