BDBM282388 2-(4-(3-amino-1H-pyrazolo [3,4-b]pyridin-5-yl) benzylamino)-N-((tetrahydro- furan-3-yl)methyl)-5- (trifluoromethyl) nicotinamide::US10030016, Example 268
SMILES Nc1n[nH]c2ncc(cc12)-c1ccc(CNc2ncc(cc2C(=O)NCC2CCOC2)C(F)(F)F)cc1
InChI Key
Data  1 IC50
  Tab Delimited (TSV)   2D SDfile   Computed 3D by Vconf -m prep SDfile
Find this compound or compounds like it in BindingDB:
Activity Spreadsheet -- Enzyme Inhibition Constant Data from BindingDB
Found 1 hit for monomerid = 282388
Target3-phosphoinositide-dependent protein kinase 1 [51-359](Homo sapiens (Human))
Sunesis Pharmaceuticals
US Patent
LigandPNGBDBM282388(2-(4-(3-amino-1H-pyrazolo [3,4-b]pyridin-5-yl) ben...)
Affinity DataIC50:  550nM. Assay description: PDK1 (amino acids 51-359) and AKT2 (amino acids 140-467 fused to PIFtide, amino acids EEQEMFRDFDYIADW) were expressed as N-terminally tagged GST fusi...
Ligand InfoPC cidPC sid
In DepthDetails US Patent