BDBM282432 2-(4-(5-aminopyrazin-2-yl) benzylamino)-5-cyano-N- ((5-fluoropyridin-3-yl)- methyl)nicotinamide::US10030016, Example 312
SMILES Nc1cnc(cn1)-c1ccc(CNc2ncc(cc2C(=O)NCc2cncc(F)c2)C#N)cc1
InChI Key InChIKey=FYCLVIKFNQTKJZ-UHFFFAOYSA-N
Data  1 IC50
  Tab Delimited (TSV)   2D SDfile   Computed 3D by Vconf -m prep SDfile
Find this compound or compounds like it in BindingDB:
Activity Spreadsheet -- Enzyme Inhibition Constant Data from BindingDB
Found 1 hit for monomerid = 282432
Target3-phosphoinositide-dependent protein kinase 1 [51-359](Homo sapiens (Human))
Sunesis Pharmaceuticals
US Patent
LigandPNGBDBM282432(2-(4-(5-aminopyrazin-2-yl) benzylamino)-5-cyano-N-...)
Affinity DataIC50: <100nM. Assay description: PDK1 (amino acids 51-359) and AKT2 (amino acids 140-467 fused to PIFtide, amino acids EEQEMFRDFDYIADW) were expressed as N-terminally tagged GST fusi...
Ligand InfoPC cidPC sid
In DepthDetails US Patent