BDBM282458 2-(4-(4-amino-7-methyl- 7H-pyrrolo[2,3-d] pyrimidin-5-yl)- benzylamino)-N-(5- fluoropyridin-2-yl)-5- (trifluoromethyl)nicotinamide::US10030016, Example 338
SMILES Cn1cc(-c2ccc(CNc3ncc(cc3C(=O)Nc3ccc(F)cn3)C(F)(F)F)cc2)c2c(N)ncnc12
InChI Key InChIKey=QDAWVJNKRITICZ-UHFFFAOYSA-N
Data  1 IC50
  Tab Delimited (TSV)   2D SDfile   Computed 3D by Vconf -m prep SDfile
Find this compound or compounds like it in BindingDB:
Activity Spreadsheet -- Enzyme Inhibition Constant Data from BindingDB
Found 1 hit for monomerid = 282458
Target3-phosphoinositide-dependent protein kinase 1 [51-359](Homo sapiens (Human))
Sunesis Pharmaceuticals
US Patent
LigandPNGBDBM282458(2-(4-(4-amino-7-methyl- 7H-pyrrolo[2,3-d] pyrimidi...)
Affinity DataIC50: <100nM. Assay description: PDK1 (amino acids 51-359) and AKT2 (amino acids 140-467 fused to PIFtide, amino acids EEQEMFRDFDYIADW) were expressed as N-terminally tagged GST fusi...
Ligand InfoPC cidPC sid
In DepthDetails US Patent