BDBM282614 US9884828, 2-109
SMILES COc1ccc(Br)cc1-c1ccc2c(N[C@H](C)C3CC3)c(nnc2c1)C(N)=O
InChI Key InChIKey=ASEZYBWPYPAHSZ-LLVKDONJSA-N
Data  1 IC50
  Tab Delimited (TSV)   2D SDfile   Computed 3D by Vconf -m prep SDfile
Find this compound or compounds like it in BindingDB:
Activity Spreadsheet -- Enzyme Inhibition Constant Data from BindingDB
Found 1 hit for monomerid = 282614
TargetLeucine-rich repeat serine/threonine-protein kinase 2(Homo sapiens (Human))
Imago Pharmaceuticals
US Patent
LigandPNGBDBM282614(US9884828, 2-109)
Affinity DataIC50:  710nMpH: 7.5 T: 2°C. Assay description: Compounds as described herein (compounds of Formula I, e.g., compounds of the above Examples) are tested for their in vitro kinase activities using v...
Ligand InfoPC cidPC sid
In DepthDetails US Patent