BDBM282618 US9884828, 2-113
SMILES NC(=O)c1cc2ccc(cc2nn1)-c1cccc(OCC2CC2)c1
InChI Key InChIKey=IHJFYQZSSMATSP-UHFFFAOYSA-N
Data  1 IC50
  Tab Delimited (TSV)   2D SDfile   Computed 3D by Vconf -m prep SDfile
Find this compound or compounds like it in BindingDB:
Activity Spreadsheet -- Enzyme Inhibition Constant Data from BindingDB
Found 1 hit for monomerid = 282618
TargetLeucine-rich repeat serine/threonine-protein kinase 2(Homo sapiens (Human))
Imago Pharmaceuticals
US Patent
LigandPNGBDBM282618(US9884828, 2-113)
Affinity DataIC50:  51nMpH: 7.5 T: 2°C. Assay description: Compounds as described herein (compounds of Formula I, e.g., compounds of the above Examples) are tested for their in vitro kinase activities using v...
Ligand InfoPC cidPC sid
In DepthDetails US Patent