BDBM282636 US9884828, 2-131
SMILES CC(C)Nc1c(nnc2ccc(cc12)-c1cncs1)C(N)=O
InChI Key InChIKey=ZDOCPROIYHZPBF-UHFFFAOYSA-N
Data  1 IC50
  Tab Delimited (TSV)   2D SDfile   Computed 3D by Vconf -m prep SDfile
Find this compound or compounds like it in BindingDB:
Activity Spreadsheet -- Enzyme Inhibition Constant Data from BindingDB
Found 1 hit for monomerid = 282636
TargetLeucine-rich repeat serine/threonine-protein kinase 2(Homo sapiens (Human))
Imago Pharmaceuticals
US Patent
LigandPNGBDBM282636(US9884828, 2-131)
Affinity DataIC50:  110nMpH: 7.5 T: 2°C. Assay description: Compounds as described herein (compounds of Formula I, e.g., compounds of the above Examples) are tested for their in vitro kinase activities using v...
Ligand InfoPC cidPC sid
In DepthDetails US Patent