BDBM282686 US9884843, Compound 30
SMILES NC1c2c(ccc(Oc3cc(F)cc(F)c3)c2Br)S(=O)(=O)C1(F)F
InChI Key InChIKey=CANPBKFACBJBOY-UHFFFAOYSA-N
Data  1 IC50
  Tab Delimited (TSV)   2D SDfile   Computed 3D by Vconf -m prep SDfile
Find this compound or compounds like it in BindingDB:
Activity Spreadsheet -- Enzyme Inhibition Constant Data from BindingDB
Found 1 hit for monomerid = 282686
TargetVascular endothelial growth factor A(Homo sapiens (Human))
Peloton Therapeutics
US Patent
LigandPNGBDBM282686(US9884843, Compound 30)
Affinity DataIC50: <5nMpH: 7.5Assay Description:The total assay volume was about 100 μL in the following configuration: 2-μL compound in DMSO, 88 μL buffer with protein and probe and...
Ligand InfoPC cidPC sid
In DepthDetails US Patent