BDBM282719 3-((4-Ethynyl-2,2-difluoro-3-hydroxy-1,1-dioxido- 2,3-dihydrobenzo[b]thiophen-5-yl)oxy)-5- fluorobenzonitrile::US9884843, Compound 63
SMILES OC1c2c(ccc(Oc3cc(F)cc(c3)C#N)c2C#C)S(=O)(=O)C1(F)F
InChI Key InChIKey=UOSAOFRQFYDAHO-UHFFFAOYSA-N
Data  1 IC50
  Tab Delimited (TSV)   2D SDfile   Computed 3D by Vconf -m prep SDfile
Find this compound or compounds like it in BindingDB:
Activity Spreadsheet -- Enzyme Inhibition Constant Data from BindingDB
Found 1 hit for monomerid = 282719
TargetVascular endothelial growth factor A(Homo sapiens (Human))
Peloton Therapeutics
US Patent
LigandPNGBDBM282719(3-((4-Ethynyl-2,2-difluoro-3-hydroxy-1,1-dioxido- ...)
Affinity DataIC50:  59nMpH: 7.5Assay Description:The total assay volume was about 100 μL in the following configuration: 2-μL compound in DMSO, 88 μL buffer with protein and probe and...
Ligand InfoPC cidPC sid
In DepthDetails US Patent