BDBM282750 US9884843, Compound 94
SMILES OC1c2c(ccc(Oc3cccc4sccc34)c2C(F)F)S(=O)(=O)C1(F)F
InChI Key InChIKey=UOGZFOIOJGVOQL-UHFFFAOYSA-N
Data  1 IC50
  Tab Delimited (TSV)   2D SDfile   Computed 3D by Vconf -m prep SDfile
Find this compound or compounds like it in BindingDB:
Activity Spreadsheet -- Enzyme Inhibition Constant Data from BindingDB
Found 1 hit for monomerid = 282750
TargetVascular endothelial growth factor A(Homo sapiens (Human))
Peloton Therapeutics
US Patent
LigandPNGBDBM282750(US9884843, Compound 94)
Affinity DataIC50:  11nMpH: 7.5Assay Description:The total assay volume was about 100 μL in the following configuration: 2-μL compound in DMSO, 88 μL buffer with protein and probe and...
Ligand InfoPC cidPC sid
In DepthDetails US Patent