BDBM283033 6-(4-(5-chloro-2-fluorophenyl)-1-(2,2-difluoroethyl)- 1H-imidazol-5-yl)imidazo[1,2-a]pyridine-3- carboxamide::US10287295, Example 234'::US11352360, Example 234'::US9884868, Example 234'
SMILES NC(=O)c1cnc2ccc(cn12)-c1c(ncn1CC(F)F)-c1cc(Cl)ccc1F
InChI Key InChIKey=BILHIBRITDUFJS-UHFFFAOYSA-N
Data  6 IC50
  Tab Delimited (TSV)   2D SDfile   Computed 3D by Vconf -m prep SDfile
Find this compound or compounds like it in BindingDB:
Activity Spreadsheet -- Enzyme Inhibition Constant Data from BindingDB
Found 6 hits for monomerid = 283033
TargetTGF-beta receptor type-1(Homo sapiens (Human))
Rigel Pharmaceuticals
US Patent
LigandPNGBDBM283033(6-(4-(5-chloro-2-fluorophenyl)-1-(2,2-difluoroethy...)
Affinity DataIC50:  1.10nMpH: 7.4 T: 2°C. Assay description: Assays for the compounds reported below were conducted in 1536-well plates and 2 mL reactions are prepared from addition of HIS-TGF-βR1 T204D or...
Ligand InfoPC cidPC sid
In DepthDetails US Patent
TargetTGF-beta receptor type-2(Homo sapiens (Human))
Rigel Pharmaceuticals
US Patent
LigandPNGBDBM283033(6-(4-(5-chloro-2-fluorophenyl)-1-(2,2-difluoroethy...)
Affinity DataIC50:  7.94E+3nM
Ligand InfoPC cidPC sid
In DepthDetails US Patent
TargetTGF-beta receptor type-2(Homo sapiens (Human))
Rigel Pharmaceuticals
US Patent
LigandPNGBDBM283033(6-(4-(5-chloro-2-fluorophenyl)-1-(2,2-difluoroethy...)
Affinity DataIC50:  7.94E+3nM
Ligand InfoPC cidPC sid
In DepthDetails US Patent
TargetTGF-beta receptor type-2(Homo sapiens (Human))
Rigel Pharmaceuticals
US Patent
LigandPNGBDBM283033(6-(4-(5-chloro-2-fluorophenyl)-1-(2,2-difluoroethy...)
Affinity DataIC50:  7.94E+3nM. Assay description: Assays for the compounds reported below were conducted in 1536-well plates and 2 mL reactions are prepared from addition of HIS-TGF-βR1 T204D or...
Ligand InfoPC cidPC sid
In DepthDetails US Patent
TargetTGF-beta receptor type-1(Homo sapiens (Human))
Rigel Pharmaceuticals
US Patent
LigandPNGBDBM283033(6-(4-(5-chloro-2-fluorophenyl)-1-(2,2-difluoroethy...)
Affinity DataIC50:  1.10nM. Assay description: Assays for the compounds reported below were conducted in 1536-well plates and 2 mL reactions are prepared from addition of HIS-TGF-βR1 T204D or...
Ligand InfoPC cidPC sid
In DepthDetails US Patent
TargetTGF-beta receptor type-1 [T204D](Homo sapiens (Human))
Rigel Pharmaceuticals
US Patent
LigandPNGBDBM283033(6-(4-(5-chloro-2-fluorophenyl)-1-(2,2-difluoroethy...)
Affinity DataIC50:  1.10nM. Assay description: Assays for the compounds reported below were conducted in 1536-well plates and 2 mL reactions are prepared from addition of HIS-TGF-βR1 T204D or...
Ligand InfoPC cidPC sid
In DepthDetails US Patent