BDBM283139 N-[1-{N′-cyano-N-[3-(difluoromethoxy)phenyl]carbamimidoyl}-3-(3,4-dichlorophenyl)-4,5-dihydro-1H-pyrazol-4-yl]-N-ethyl-D-alaninamide Isomer 1::US10023539, Example 7.1::US10023539, Example 7.2
SMILES CCN(C1CN(N=C1c1ccc(Cl)c(Cl)c1)C(\Nc1cccc(OC(F)F)c1)=N/C#N)C(=O)[C@@H](C)N
InChI Key InChIKey=DVPSDCLFZOUIOA-BSOCMFCZSA-N
Data  3 IC50
  Tab Delimited (TSV)   2D SDfile   Computed 3D by Vconf -m prep SDfile
Find this compound or compounds like it in BindingDB:
Activity Spreadsheet -- Enzyme Inhibition Constant Data from BindingDB
Found 3 hits for monomerid = 283139
TargetN-lysine methyltransferase SMYD2(Homo sapiens (Human))
Bayer Pharma Aktiengesellschaft
US Patent
LigandPNGBDBM283139(N-[1-{N′-cyano-N-[3-(difluoromethoxy)phenyl]...)
Affinity DataIC50:  13.5nMpH: 9.0Assay Description:SMYD2 inhibitory activities of the compounds described in the present invention were quantified using a scintillation proximity assay (SPA) which mea...
Ligand InfoPC cidPC sid
In DepthDetails US Patent
TargetN-lysine methyltransferase SMYD2(Homo sapiens (Human))
Bayer Pharma Aktiengesellschaft
US Patent
LigandPNGBDBM283139(N-[1-{N′-cyano-N-[3-(difluoromethoxy)phenyl]...)
Affinity DataIC50:  1.05E+3nMpH: 9.0Assay Description:SMYD2 inhibitory activities of the compounds described in the present invention were quantified using a scintillation proximity assay (SPA) which mea...
Ligand InfoPC cidPC sid
In DepthDetails US Patent
TargetN-lysine methyltransferase SMYD2(Homo sapiens (Human))
Bayer Pharma Aktiengesellschaft
US Patent
LigandPNGBDBM283139(N-[1-{N′-cyano-N-[3-(difluoromethoxy)phenyl]...)
Affinity DataIC50:  13.2nM. Assay description: For the detection of SMYD2 cellular methylation activity an In Cell Western (ICW) assay was established. This assay allows rapid processing of multip...
Ligand InfoPC cidPC sid
In DepthDetails US Patent