BDBM283207 N-[3-(4-chloro-3-methylphenyl)-1-{N′-cyano-N-[3-(difluoromethoxy)phenyl]carbamimidoyl}-4,5-dihydro-1H-pyrazol-4-yl]-N-ethyl-N2-methyl-D-alaninamide::US10023539, Example 37
SMILES CCN(C1CN(N=C1c1ccc(Cl)c(C)c1)C(\Nc1cccc(OC(F)F)c1)=N/C#N)C(=O)[C@@H](C)NC
InChI Key InChIKey=YLXKMPKVBVBGHR-UJONTBEJSA-N
Data  1 IC50
  Tab Delimited (TSV)   2D SDfile   Computed 3D by Vconf -m prep SDfile
Find this compound or compounds like it in BindingDB:
Activity Spreadsheet -- Enzyme Inhibition Constant Data from BindingDB
Found 1 hit for monomerid = 283207
TargetN-lysine methyltransferase SMYD2(Homo sapiens (Human))
Bayer Pharma Aktiengesellschaft
US Patent
LigandPNGBDBM283207(N-[3-(4-chloro-3-methylphenyl)-1-{N′-cyano-N...)
Affinity DataIC50:  231nMpH: 9.0Assay Description:SMYD2 inhibitory activities of the compounds described in the present invention were quantified using a scintillation proximity assay (SPA) which mea...
Ligand InfoPC cidPC sid
In DepthDetails US Patent