BDBM283299 4-[2-(4-dimethylamino-piperidin-1- yl)-1-methyl-5-(2-methyl-2H- indazol-6-yl)-6-oxo-1,6-dihydro- pyrimidin-4-yl]-2-fluoro- benzonitrile::US10023543, Example 80::US10207999, Example 80::US10328077, Example 80::US10548896, Example 80::US10849898, Example 80::US10960005, Example 80::US11084793, Example 80::US9573930, Example 80::US9771329, Example 80::US9776974, Example 80
SMILES CN(C)C1CCN(CC1)c1nc(-c2ccc(C#N)c(F)c2)c(-c2ccc3cn(C)nc3c2)c(=O)n1C
InChI Key InChIKey=YNXRJSACDVGJNC-UHFFFAOYSA-N
Data  12 IC50
  Tab Delimited (TSV)   2D SDfile   Computed 3D by Vconf -m prep SDfile
Find this compound or compounds like it in BindingDB:
Activity Spreadsheet -- Enzyme Inhibition Constant Data from BindingDB
Found 12 hits for monomerid = 283299
TargetLysine-specific histone demethylase 1A(Homo sapiens (Human))
Celgene Quanticel Research
US Patent
LigandPNGBDBM283299(4-[2-(4-dimethylamino-piperidin-1- yl)-1-methyl-5-...)
Affinity DataIC50: <100nMT: 2°C. Assay description: This assay determines the ability of a test compound to inhibit LSD1 demethylase activity. E. coli expressed full-length human LSD1 (Accession number...
Ligand InfoPC cidPC sid
In DepthDetails US Patent
TargetLysine-specific histone demethylase 1A(Homo sapiens (Human))
Celgene Quanticel Research
US Patent
LigandPNGBDBM283299(4-[2-(4-dimethylamino-piperidin-1- yl)-1-methyl-5-...)
Affinity DataIC50: <100nMT: 2°C. Assay description: This assay determines the ability of a test compound to inhibit LSD1 demethylase activity. E. coli expressed full-length human LSD1 (Accession number...
Ligand InfoPC cidPC sid
In DepthDetails US Patent
TargetLysine-specific histone demethylase 1A(Homo sapiens (Human))
Celgene Quanticel Research
US Patent
LigandPNGBDBM283299(4-[2-(4-dimethylamino-piperidin-1- yl)-1-methyl-5-...)
Affinity DataIC50: <100nM. Assay description: The enzymatic assay of LSD1 activity is based on Time Resolved-Fluorescence Resonance Energy Transfer (TR-FRET) detection. The inhibitory properties ...
Ligand InfoPC cidPC sid
In DepthDetails US Patent
TargetLysine-specific histone demethylase 1A(Homo sapiens (Human))
Celgene Quanticel Research
US Patent
LigandPNGBDBM283299(4-[2-(4-dimethylamino-piperidin-1- yl)-1-methyl-5-...)
Affinity DataIC50: <100nM. Assay description: The enzymatic assay of LSD1 activity is based on Time Resolved-Fluorescence Resonance Energy Transfer (TR-FRET) detection. The inhibitory properties ...
Ligand InfoPC cidPC sid
In DepthDetails US Patent
TargetLysine-specific histone demethylase 1A(Homo sapiens (Human))
Celgene Quanticel Research
US Patent
LigandPNGBDBM283299(4-[2-(4-dimethylamino-piperidin-1- yl)-1-methyl-5-...)
Affinity DataIC50: <100nM. Assay description: This assay determines the ability of a test compound to inhibit LSD-1 demethylase activity. E. coli expressed full-length human LSD-1 (Accession numb...
Ligand InfoPC cidPC sid
In DepthDetails US Patent
TargetLysine-specific histone demethylase 1A(Homo sapiens (Human))
Celgene Quanticel Research
US Patent
LigandPNGBDBM283299(4-[2-(4-dimethylamino-piperidin-1- yl)-1-methyl-5-...)
Affinity DataIC50: <100nM. Assay description: This assay determines the ability of a test compound to inhibit LSD1 demethylase activity. E. coli expressed full-length human LSD1 (Accession number...
Ligand InfoPC cidPC sid
In DepthDetails US Patent
TargetLysine-specific histone demethylase 1A(Homo sapiens (Human))
Celgene Quanticel Research
US Patent
LigandPNGBDBM283299(4-[2-(4-dimethylamino-piperidin-1- yl)-1-methyl-5-...)
Affinity DataIC50: <100nM. Assay description: To analyze LSD1 inhibitor efficacy in cells, a CD11b flow cytometry assay was performed. LSD1 inhibition induces CD11b expression in THP-1 (AML) cell...
Ligand InfoPC cidPC sid
In DepthDetails US Patent
TargetLysine-specific histone demethylase 1A(Homo sapiens (Human))
Celgene Quanticel Research
US Patent
LigandPNGBDBM283299(4-[2-(4-dimethylamino-piperidin-1- yl)-1-methyl-5-...)
Affinity DataIC50: <100nM. Assay description: This assay determines the ability of a test compound to inhibit LSD-1 demethylase activity. E. coli expressed full-length human LSD-1 (Accession numb...
Ligand InfoPC cidPC sid
In DepthDetails US Patent
TargetLysine-specific histone demethylase 1A(Homo sapiens (Human))
Celgene Quanticel Research
US Patent
LigandPNGBDBM283299(4-[2-(4-dimethylamino-piperidin-1- yl)-1-methyl-5-...)
Affinity DataIC50: <100nM. Assay description: This assay determines the ability of a test compound to inhibit LSD-1 demethylase activity. E. coli expressed full-length human LSD-1 (Accession numb...
Ligand InfoPC cidPC sid
In DepthDetails US Patent
TargetLysine-specific histone demethylase 1A(Homo sapiens (Human))
Celgene Quanticel Research
US Patent
LigandPNGBDBM283299(4-[2-(4-dimethylamino-piperidin-1- yl)-1-methyl-5-...)
Affinity DataIC50: <100nM. Assay description: This assay determines the ability of a test compound to inhibit LSD-1 demethylase activity. E. coli expressed full-length human LSD-1 (Accession numb...
Ligand InfoPC cidPC sid
In DepthDetails US Patent
TargetLysine-specific histone demethylase 1A(Homo sapiens (Human))
Celgene Quanticel Research
US Patent
LigandPNGBDBM283299(4-[2-(4-dimethylamino-piperidin-1- yl)-1-methyl-5-...)
Affinity DataIC50: <100nM. Assay description: The enzymatic assay of LSD-1 activity is based on Tnne Resolved-Fluorescence Resonance Energy Transfer (TR-FRET) detection. The inhibitory properties...
Ligand InfoPC cidPC sid
In DepthDetails US Patent
TargetLysine-specific histone demethylase 1A(Homo sapiens (Human))
Celgene Quanticel Research
US Patent
LigandPNGBDBM283299(4-[2-(4-dimethylamino-piperidin-1- yl)-1-methyl-5-...)
Affinity DataIC50: <100nM. Assay description: This assay determines the ability of a test compound to inhibit LSD1 demethylase activity. E. coli expressed full-length human LSD1 (Accession number...
Ligand InfoPC cidPC sid
In DepthDetails US Patent