BDBM283354 N-((1-aminoisoquinolin-6-yl)methyl)-2-((3- cyanoquinolin-6-yl)methyl)isonicotinamide::US10023557, Example 6::US10266515, Example 6::US10308637, Example 6::US11021463, Example 6::US9611252, Example 6
SMILES Nc1nccc2cc(CNC(=O)c3ccnc(Cc4ccc5ncc(cc5c4)C#N)c3)ccc12
InChI Key InChIKey=KYRAMUYNXMHHJI-UHFFFAOYSA-N
Data  5 IC50
  Tab Delimited (TSV)   2D SDfile   Computed 3D by Vconf -m prep SDfile
Find this compound or compounds like it in BindingDB:
Activity Spreadsheet -- Enzyme Inhibition Constant Data from BindingDB
Found 5 hits for monomerid = 283354
TargetPlasma kallikrein(Homo sapiens (Human))
Lifesci Pharmaceuticals
US Patent
LigandPNGBDBM283354(N-((1-aminoisoquinolin-6-yl)methyl)-2-((3- cyanoqu...)
Affinity DataIC50: <100nMpH: 7.5Assay Description:A 10 mM solution of the test compound was made in DMSO. This solution was serially diluted 1:5 in DMSO to yield 2000, 400, 80, 16, 3.2, 0.64, 0.128, ...
Ligand InfoPC cidPC sid
In DepthDetails US Patent
TargetPlasma kallikrein(Homo sapiens (Human))
Lifesci Pharmaceuticals
US Patent
LigandPNGBDBM283354(N-((1-aminoisoquinolin-6-yl)methyl)-2-((3- cyanoqu...)
Affinity DataIC50: <100nM. Assay description: The ability of the compounds disclosed herein to inhibit human plasma kallikrein activity was quantified according to the procedures below.A 10 mM so...
Ligand InfoPC cidPC sid
In DepthDetails US Patent
TargetPlasma kallikrein(Homo sapiens (Human))
Lifesci Pharmaceuticals
US Patent
LigandPNGBDBM283354(N-((1-aminoisoquinolin-6-yl)methyl)-2-((3- cyanoqu...)
Affinity DataIC50: <100nM. Assay description: A 10 mM solution of the test compound was made in DMSO. This solution was serially diluted 1:5 in DMSO to yield 2000, 400, 80, 16, 3.2, 0.64, 0.128, ...
Ligand InfoPC cidPC sid
In DepthDetails US Patent
TargetPlasma kallikrein(Homo sapiens (Human))
Lifesci Pharmaceuticals
US Patent
LigandPNGBDBM283354(N-((1-aminoisoquinolin-6-yl)methyl)-2-((3- cyanoqu...)
Affinity DataIC50: <100nM. Assay description: A 10 mM solution of the test compound was made in DMSO. This solution was serially diluted 1:5 in DMSO to yield 2000, 400, 80, 16, 3.2, 0.64, 0.128, ...
Ligand InfoPC cidPC sid
In DepthDetails US Patent
TargetMitogen-activated protein kinase kinase kinase kinase 1(Homo sapiens (Human))
Lifesci Pharmaceuticals
US Patent
LigandPNGBDBM283354(N-((1-aminoisoquinolin-6-yl)methyl)-2-((3- cyanoqu...)
Affinity DataIC50: <100nM. Assay description: A 10 mM solution of the test compound was made in DMSO. This solution was serially diluted 1:5 in DMSO to yield 2000, 400, 80, 16, 3.2, 0.64, 0.128, ...
Ligand InfoPC cidPC sid
In DepthDetails US Patent