BDBM28351 2-{2,4-dioxo-1,3-diazaspiro[4.6]undecan-3-yl}-N-[2-(phenylsulfanyl)phenyl]acetamide::ZINC03307332, 16
SMILES O=C(CN1C(=O)NC2(CCCCCC2)C1=O)Nc1ccccc1Sc1ccccc1
InChI Key InChIKey=ZZUOERDVYIHZSM-UHFFFAOYSA-N
Data  2 IC50
  Tab Delimited (TSV)   2D SDfile   Computed 3D by Vconf -m prep SDfile
Find this compound or compounds like it in BindingDB:
Activity Spreadsheet -- Enzyme Inhibition Constant Data from BindingDB
Found 2 hits for monomerid = 28351
TargetTrypanothione reductase(Trypanosoma brucei brucei)
University Of Alberta
LigandPNGBDBM28351(2-{2,4-dioxo-1,3-diazaspiro[4.6]undecan-3-yl}-N-[2...)
Affinity DataIC50: >1.00E+5nMpH: 7.5 T: 2°C. Assay description: Inhibition of TryR was carried out in 96-well plates using a Biotek Precision 2000 automated liquid handler. Reaction was initiated by addition of NA...
In DepthDetails ArticlePubMed
TargetTrypanothione reductase(Trypanosoma cruzi)
University Of Alberta
LigandPNGBDBM28351(2-{2,4-dioxo-1,3-diazaspiro[4.6]undecan-3-yl}-N-[2...)
Affinity DataIC50: >1.00E+5nMpH: 7.5 T: 2°C. Assay description: Inhibition of TryR was carried out in 96-well plates using a Biotek Precision 2000 automated liquid handler. Reaction was initiated by addition of NA...
In DepthDetails ArticlePubMed