BDBM283617 N-((6-amino-2,4-dimethylpyridin-3-yl)methyl)- 2-((3-methoxyquinolin-6- yl)methyl)isonicotinamide::US10023557, Example 264::US10308637, Example 264
SMILES COc1cnc2ccc(Cc3cc(ccn3)C(=O)NCc3c(C)cc(N)nc3C)cc2c1
InChI Key InChIKey=RKVFEEITZZUJSF-UHFFFAOYSA-N
Data  2 IC50  1 EC50
  Tab Delimited (TSV)   2D SDfile   Computed 3D by Vconf -m prep SDfile
Find this compound or compounds like it in BindingDB:
Activity Spreadsheet -- Enzyme Inhibition Constant Data from BindingDB
Found 3 hits for monomerid = 283617
TargetPlasma kallikrein(Homo sapiens (Human))
Lifesci Pharmaceuticals
US Patent
LigandPNGBDBM283617(N-((6-amino-2,4-dimethylpyridin-3-yl)methyl)- 2-((...)
Affinity DataIC50: <100nMpH: 7.5Assay Description:A 10 mM solution of the test compound was made in DMSO. This solution was serially diluted 1:5 in DMSO to yield 2000, 400, 80, 16, 3.2, 0.64, 0.128, ...
Ligand InfoPC cidPC sid
In DepthDetails US Patent
TargetMitogen-activated protein kinase kinase kinase kinase 1(Homo sapiens (Human))
Lifesci Pharmaceuticals
US Patent
LigandPNGBDBM283617(N-((6-amino-2,4-dimethylpyridin-3-yl)methyl)- 2-((...)
Affinity DataIC50: <100nM. Assay description: A 10 mM solution of the test compound was made in DMSO. This solution was serially diluted 1:5 in DMSO to yield 2000, 400, 80, 16, 3.2, 0.64, 0.128, ...
Ligand InfoPC cidPC sid
In DepthDetails US Patent
TargetPlasma kallikrein(Homo sapiens (Human))
Lifesci Pharmaceuticals
US Patent
LigandPNGBDBM283617(N-((6-amino-2,4-dimethylpyridin-3-yl)methyl)- 2-((...)
Affinity DataEC50: <100nM. Assay description: The test compounds at various concentrations, also prepared by serial dilutions as described above, are added to the test wells. The volume of test c...
Ligand InfoPC cidPC sid
In DepthDetails US Patent