BDBM283671 N-((6-amino-2,4-dimethylpyridin-3-yl)methyl)- 2-((8-(2-hydroxypropan-2-yl)-3-methylquinolin- 6-yl)methyl)isonicotinamide::US10023557, Example 318::US10308637, Example 318
SMILES Cc1cnc2c(cc(Cc3cc(ccn3)C(=O)NCc3c(C)cc(N)nc3C)cc2c1)C(C)(C)O
InChI Key InChIKey=CCPFSMSMBYNPQC-UHFFFAOYSA-N
Data  2 IC50
  Tab Delimited (TSV)   2D SDfile   Computed 3D by Vconf -m prep SDfile
Find this compound or compounds like it in BindingDB:
Activity Spreadsheet -- Enzyme Inhibition Constant Data from BindingDB
Found 2 hits for monomerid = 283671
TargetMitogen-activated protein kinase kinase kinase kinase 1(Homo sapiens (Human))
Lifesci Pharmaceuticals
US Patent
LigandPNGBDBM283671(N-((6-amino-2,4-dimethylpyridin-3-yl)methyl)- 2-((...)
Affinity DataIC50: <100nM. Assay description: A 10 mM solution of the test compound was made in DMSO. This solution was serially diluted 1:5 in DMSO to yield 2000, 400, 80, 16, 3.2, 0.64, 0.128, ...
Ligand InfoPC cidPC sid
In DepthDetails US Patent
TargetPlasma kallikrein(Homo sapiens (Human))
Lifesci Pharmaceuticals
US Patent
LigandPNGBDBM283671(N-((6-amino-2,4-dimethylpyridin-3-yl)methyl)- 2-((...)
Affinity DataIC50: <100nMpH: 7.5Assay Description:A 10 mM solution of the test compound was made in DMSO. This solution was serially diluted 1:5 in DMSO to yield 2000, 400, 80, 16, 3.2, 0.64, 0.128, ...
Ligand InfoPC cidPC sid
In DepthDetails US Patent