BDBM283792 1-[4-(azetidin-3-ylidenemethyl)phenyl]-3-(4-methoxyphenyl)urea::US10023559, Example 117
SMILES [#6]-[#8]-c1ccc(-[#7]-[#6](=O)-[#7]-c2ccc(\[#6]=[#6]-3/[#6]-[#7]-[#6]-3)cc2)cc1
InChI Key InChIKey=YZEULGSIBWMIOT-UHFFFAOYSA-N
Data  1 KI  1 Other
  Tab Delimited (TSV)   2D SDfile   Computed 3D by Vconf -m prep SDfile
Find this compound or compounds like it in BindingDB:
Activity Spreadsheet -- Enzyme Inhibition Constant Data from BindingDB
Found 2 hits for monomerid = 283792
TargetTrace amine-associated receptor 1(Rattus norvegicus (Rat))
Hoffmann-La Roche
US Patent
LigandPNGBDBM283792(1-[4-(azetidin-3-ylidenemethyl)phenyl]-3-(4-methox...)
Affinity DataKi:  15nMpH: 7.4Assay Description:HEK-293 cells stably expressing rat TAAR1 were maintained at 37° C. and 5% CO2 in DMEM high glucose medium, containing fetal calf serum (10%, heat in...
Ligand InfoPC cidPC sid
In DepthDetails US Patent
TargetTrace amine-associated receptor 1(Mus musculus (Mouse))
Hoffmann-La Roche
US Patent
LigandPNGBDBM283792(1-[4-(azetidin-3-ylidenemethyl)phenyl]-3-(4-methox...)
Affinity DatapH: 7.4Assay Description:HEK-293 cells stably expressing mouse TAAR1 were maintained at 37° C. and 5% CO2 in DMEM high glucose medium, containing fetal calf serum (10%, heat ...
Ligand InfoPC cidPC sid
In DepthDetails US Patent