BDBM283808 6-((5-Cyano-2-pyridinyl)amino)-N-((2R)-2-fluoro-3-hydroxy-3-methylbutyl)-4-(isopropylamino)nicotinamide::US10023562, Example 2
SMILES CCOC(=O)c1cnc(Cl)cc1NC(C)C.CC(C)Nc1cc(Nc2ccc(cn2)C#N)ncc1C(=O)NC[C@@H](F)C(C)(C)O
InChI Key InChIKey=LAIOMMQWMNQGMQ-PKLMIRHRSA-N
Data  1 IC50
  Tab Delimited (TSV)   2D SDfile   Computed 3D by Vconf -m prep SDfile
Find this compound or compounds like it in BindingDB:
Activity Spreadsheet -- Enzyme Inhibition Constant Data from BindingDB
Found 1 hit for monomerid = 283808
TargetInterleukin-1 receptor-associated kinase 4(Homo sapiens (Human))
Bristol-Myers Squibb
US Patent
LigandPNGBDBM283808(6-((5-Cyano-2-pyridinyl)amino)-N-((2R)-2-fluoro-3-...)
Affinity DataIC50:  2nMpH: 7.2 T: 2°C. Assay description: The assays were performed in U-bottom 384-well plates. The final assay volume was 30 μL prepared from 15 μL additions of enzyme and substra...
Ligand InfoPC cidPC sid
In DepthDetails US Patent