BDBM283877 US10023562, Example 69::US10544133, Example 69::US9657009, 69
SMILES CNC(=O)N[C@H](C)CCNC(=O)c1cnc(Nc2ncc(cn2)C#N)cc1NC(C)C
InChI Key InChIKey=OMTJSPFMYXYRGD-CYBMUJFWSA-N
Data  3 IC50
  Tab Delimited (TSV)   2D SDfile   Computed 3D by Vconf -m prep SDfile
Find this compound or compounds like it in BindingDB:
Activity Spreadsheet -- Enzyme Inhibition Constant Data from BindingDB
Found 3 hits for monomerid = 283877
TargetInterleukin-1 receptor-associated kinase 4(Homo sapiens (Human))
Bristol-Myers Squibb
US Patent
LigandPNGBDBM283877(US10023562, Example 69 | US10544133, Example 69 | ...)
Affinity DataIC50:  1.80nMpH: 7.2 T: 2°C. Assay description: The assays were performed in U-bottom 384-well plates. The final assay volume was 30 μL prepared from 15 μL additions of enzyme and substra...
Ligand InfoPC cidPC sid
In DepthDetails US Patent
TargetInterleukin-1 receptor-associated kinase 4(Homo sapiens (Human))
Bristol-Myers Squibb
US Patent
LigandPNGBDBM283877(US10023562, Example 69 | US10544133, Example 69 | ...)
Affinity DataIC50:  1.80nM. Assay description: The assays were performed in U-bottom 384-well plates. The final assay volume was 30 μL prepared from 15 μL additions of enzyme and substra...
Ligand InfoPC cidPC sid
In DepthDetails US Patent
TargetInterleukin-1 receptor-associated kinase 4(Homo sapiens (Human))
Bristol-Myers Squibb
US Patent
LigandPNGBDBM283877(US10023562, Example 69 | US10544133, Example 69 | ...)
Affinity DataIC50:  1.80nM. Assay description: The assays were performed in U-bottom 384-well plates. The final assay volume was 30 μL prepared from 15 μL additions of enzyme and substra...
Ligand InfoPC cidPC sid
In DepthDetails US Patent