BDBM283883 US10023562, Example 75::US10544133, Example 75::US9657009, 75
SMILES CC(C)(O)[C@H](F)CNC(=O)c1cnc(Nc2ncc(cc2Cl)C#N)cc1Nc1ncc(s1)C(C)(C)O
InChI Key InChIKey=WWASLMUABRTMJU-MRXNPFEDSA-N
Data  3 IC50
  Tab Delimited (TSV)   2D SDfile   Computed 3D by Vconf -m prep SDfile
Find this compound or compounds like it in BindingDB:
Activity Spreadsheet -- Enzyme Inhibition Constant Data from BindingDB
Found 3 hits for monomerid = 283883
TargetInterleukin-1 receptor-associated kinase 4(Homo sapiens (Human))
Bristol-Myers Squibb
US Patent
LigandPNGBDBM283883(US10023562, Example 75 | US10544133, Example 75 | ...)
Affinity DataIC50:  1.40nMpH: 7.2 T: 2°C. Assay description: The assays were performed in U-bottom 384-well plates. The final assay volume was 30 μL prepared from 15 μL additions of enzyme and substra...
Ligand InfoPC cidPC sid
In DepthDetails US Patent
TargetInterleukin-1 receptor-associated kinase 4(Homo sapiens (Human))
Bristol-Myers Squibb
US Patent
LigandPNGBDBM283883(US10023562, Example 75 | US10544133, Example 75 | ...)
Affinity DataIC50:  1.40nM. Assay description: The assays were performed in U-bottom 384-well plates. The final assay volume was 30 μL prepared from 15 μL additions of enzyme and substra...
Ligand InfoPC cidPC sid
In DepthDetails US Patent
TargetInterleukin-1 receptor-associated kinase 4(Homo sapiens (Human))
Bristol-Myers Squibb
US Patent
LigandPNGBDBM283883(US10023562, Example 75 | US10544133, Example 75 | ...)
Affinity DataIC50:  1.40nM. Assay description: The assays were performed in U-bottom 384-well plates. The final assay volume was 30 μL prepared from 15 μL additions of enzyme and substra...
Ligand InfoPC cidPC sid
In DepthDetails US Patent