BDBM283897 US10023562, Example 89::US10544133, Example 89::US9657009, 89
SMILES CC(C)(O)[C@H](F)CNC(=O)c1cnc(Nc2ncc(F)cc2F)cc1NC1CC1
InChI Key InChIKey=CCFSKEQFPNJHHC-OAHLLOKOSA-N
Data  3 IC50
  Tab Delimited (TSV)   2D SDfile   Computed 3D by Vconf -m prep SDfile
Find this compound or compounds like it in BindingDB:
Activity Spreadsheet -- Enzyme Inhibition Constant Data from BindingDB
Found 3 hits for monomerid = 283897
TargetInterleukin-1 receptor-associated kinase 4(Homo sapiens (Human))
Bristol-Myers Squibb
US Patent
LigandPNGBDBM283897(US10023562, Example 89 | US10544133, Example 89 | ...)
Affinity DataIC50:  14.5nMpH: 7.2 T: 2°C. Assay description: The assays were performed in U-bottom 384-well plates. The final assay volume was 30 μL prepared from 15 μL additions of enzyme and substra...
Ligand InfoPC cidPC sid
In DepthDetails US Patent
TargetInterleukin-1 receptor-associated kinase 4(Homo sapiens (Human))
Bristol-Myers Squibb
US Patent
LigandPNGBDBM283897(US10023562, Example 89 | US10544133, Example 89 | ...)
Affinity DataIC50:  14.5nM. Assay description: The assays were performed in U-bottom 384-well plates. The final assay volume was 30 μL prepared from 15 μL additions of enzyme and substra...
Ligand InfoPC cidPC sid
In DepthDetails US Patent
TargetInterleukin-1 receptor-associated kinase 4(Homo sapiens (Human))
Bristol-Myers Squibb
US Patent
LigandPNGBDBM283897(US10023562, Example 89 | US10544133, Example 89 | ...)
Affinity DataIC50:  14.5nM. Assay description: The assays were performed in U-bottom 384-well plates. The final assay volume was 30 μL prepared from 15 μL additions of enzyme and substra...
Ligand InfoPC cidPC sid
In DepthDetails US Patent