BDBM283954 US10023562, Example 146::US10544133, Example 146::US9657009, 146
SMILES Cn1nnnc1-c1cccc(Nc2cc(Nc3ncc(cc3Cl)C#N)ncc2C(=O)NC[C@@H](F)C(C)(C)O)c1
InChI Key InChIKey=XVGUHXLZWMAUPQ-HXUWFJFHSA-N
Data  3 IC50
  Tab Delimited (TSV)   2D SDfile   Computed 3D by Vconf -m prep SDfile
Find this compound or compounds like it in BindingDB:
Activity Spreadsheet -- Enzyme Inhibition Constant Data from BindingDB
Found 3 hits for monomerid = 283954
TargetInterleukin-1 receptor-associated kinase 4(Homo sapiens (Human))
Bristol-Myers Squibb
US Patent
LigandPNGBDBM283954(US10023562, Example 146 | US10544133, Example 146 ...)
Affinity DataIC50:  8.5nMpH: 7.2 T: 2°C. Assay description: The assays were performed in U-bottom 384-well plates. The final assay volume was 30 μL prepared from 15 μL additions of enzyme and substra...
Ligand InfoPC cidPC sid
In DepthDetails US Patent
TargetInterleukin-1 receptor-associated kinase 4(Homo sapiens (Human))
Bristol-Myers Squibb
US Patent
LigandPNGBDBM283954(US10023562, Example 146 | US10544133, Example 146 ...)
Affinity DataIC50:  8.5nM. Assay description: The assays were performed in U-bottom 384-well plates. The final assay volume was 30 μL prepared from 15 μL additions of enzyme and substra...
Ligand InfoPC cidPC sid
In DepthDetails US Patent
TargetInterleukin-1 receptor-associated kinase 4(Homo sapiens (Human))
Bristol-Myers Squibb
US Patent
LigandPNGBDBM283954(US10023562, Example 146 | US10544133, Example 146 ...)
Affinity DataIC50:  8.5nM. Assay description: The assays were performed in U-bottom 384-well plates. The final assay volume was 30 μL prepared from 15 μL additions of enzyme and substra...
Ligand InfoPC cidPC sid
In DepthDetails US Patent