BDBM28398 (2E)-3-{3-[6-(4-methyl-1,4-diazepan-1-yl)pyridin-2-yl]phenyl}prop-2-enoic acid::pyridine inhibitor, 27
SMILES CN1CCCN(CC1)c1cccc(n1)-c1cccc(\C=C\C(O)=O)c1
InChI Key InChIKey=BLWKVHOHRHEESG-MDZDMXLPSA-N
Data  2 IC50
  Tab Delimited (TSV)   2D SDfile   Computed 3D by Vconf -m prep SDfile
Find this compound or compounds like it in BindingDB:
Activity Spreadsheet -- Enzyme Inhibition Constant Data from BindingDB
Found 2 hits for monomerid = 28398
TargetSerine/threonine-protein kinase pim-2(Homo sapiens (Human))
Boehringer Ingelheim Pharmaceuticals
LigandPNGBDBM28398((2E)-3-{3-[6-(4-methyl-1,4-diazepan-1-yl)pyridin-2...)
Affinity DataIC50:  46nM. Assay description: The activity of Pim kinase was measured in a homogeneous luciferase assay using GST-Pim, biotinylated peptide substrate and a luciferin-luciferase de...
In DepthDetails ArticlePubMed
TargetSerine/threonine-protein kinase pim-1(Homo sapiens (Human))
Boehringer Ingelheim Pharmaceuticals
LigandPNGBDBM28398((2E)-3-{3-[6-(4-methyl-1,4-diazepan-1-yl)pyridin-2...)
Affinity DataIC50:  50nMpH: 7.5 T: 2°C. Assay description: The activity of Pim kinase was measured in a homogeneous luciferase assay using GST-Pim, biotinylated peptide substrate and a luciferin-luciferase de...
In DepthDetails ArticlePubMed