BDBM28467 (2R)-2-({12-bromo-11-[(methoxycarbonyl)amino]-8-oxatricyclo[7.4.0.0^{2,7}]trideca-1(9),2,4,6,10,12-hexaene-4-}sulfonamido)-3-methylbutanoic acid::dibenzofuran (DBF) scaffold, (R)-13a
SMILES COC(=O)Nc1cc2oc3ccc(cc3c2cc1Br)S(=O)(=O)N[C@H](C(C)C)C(O)=O
InChI Key InChIKey=HFUOQSPXLWRCGA-QGZVFWFLSA-N
Data  2 IC50
  Tab Delimited (TSV)   2D SDfile   Computed 3D by Vconf -m prep SDfile
Find this compound or compounds like it in BindingDB:
Activity Spreadsheet -- Enzyme Inhibition Constant Data from BindingDB
Found 2 hits for monomerid = 28467
TargetCollagenase 3(Homo sapiens (Human))
Wyeth Research
LigandPNGBDBM28467((2R)-2-({12-bromo-11-[(methoxycarbonyl)amino]-8-ox...)
Affinity DataIC50:  2.54E+4nM. Assay description: The assays for human MMP activity were performed by incubating fluorogenic peptide substrate with recombinant human MMP catalytic domain along with v...
In DepthDetails ArticlePubMed
TargetMacrophage metalloelastase(Homo sapiens (Human))
Wyeth Research
LigandPNGBDBM28467((2R)-2-({12-bromo-11-[(methoxycarbonyl)amino]-8-ox...)
Affinity DataIC50:  1.05E+3nMpH: 7.5 T: 2°C. Assay description: The assays for human MMP activity were performed by incubating fluorogenic peptide substrate with recombinant human MMP catalytic domain along with v...
In DepthDetails ArticlePubMed