BDBM284741 US10023575, Example 32::US10479794, Example 32::US10875867, Example 32::US11691977, Example 32
SMILES FC(F)(F)c1ccc(cc1)C1(CCCOC1)NC(=O)c1cnn2cc(cnc12)C1CC1
InChI Key InChIKey=QUTYLLJRFJSOIO-UHFFFAOYSA-N
Data  8 IC50
  Tab Delimited (TSV)   2D SDfile   Computed 3D by Vconf -m prep SDfile
Find this compound or compounds like it in BindingDB:
Activity Spreadsheet -- Enzyme Inhibition Constant Data from BindingDB
Found 8 hits for monomerid = 284741
TargetcGMP-dependent 3',5'-cyclic phosphodiesterase(Homo sapiens (Human))
Boehringer Ingelheim International
US Patent
LigandPNGBDBM284741(US10023575, Example 32 | US10479794, Example 32 | ...)
Affinity DataIC50:  67nMT: 2°C. Assay description: All reactions were performed in 384 well plates, Perkin Elmer black optiplates and IMAP reaction buffer with 0.1% Tween20 (kit component)Compounds we...
Ligand InfoPC cidPC sid
In DepthDetails US Patent
TargetcAMP and cAMP-inhibited cGMP 3',5'-cyclic phosphodiesterase 10A(Homo sapiens (Human))
Boehringer Ingelheim International
US Patent
LigandPNGBDBM284741(US10023575, Example 32 | US10479794, Example 32 | ...)
Affinity DataIC50: >1.00E+4nMT: 2°C. Assay description: All reactions were performed in 384 well plates, Perkin Elmer black optiplates and IMAP reaction buffer with 0.1% Tween20 (kit component)Compounds we...
Ligand InfoPC cidPC sid
In DepthDetails US Patent
TargetcGMP-dependent 3',5'-cyclic phosphodiesterase(Homo sapiens (Human))
Boehringer Ingelheim International
US Patent
LigandPNGBDBM284741(US10023575, Example 32 | US10479794, Example 32 | ...)
Affinity DataIC50:  67nM. Assay description: The inhibition of PDE 2A or 10 enzyme activity was assessed using IMAP-Phosphodiesterase-cAMP fluorescence labeled substrate (Molecular Devices, Orde...
Ligand InfoPC cidPC sid
In DepthDetails US Patent
TargetcAMP and cAMP-inhibited cGMP 3',5'-cyclic phosphodiesterase 10A(Homo sapiens (Human))
Boehringer Ingelheim International
US Patent
LigandPNGBDBM284741(US10023575, Example 32 | US10479794, Example 32 | ...)
Affinity DataIC50: >1.00E+4nM. Assay description: Assay Principle: The PDE reaction cleaves cAMP to AMP. The IMAP system (Molecular Device) using fluorescence polarization (FP) as detection principle...
Ligand InfoPC cidPC sid
In DepthDetails US Patent
TargetcGMP-dependent 3',5'-cyclic phosphodiesterase(Homo sapiens (Human))
Boehringer Ingelheim International
US Patent
LigandPNGBDBM284741(US10023575, Example 32 | US10479794, Example 32 | ...)
Affinity DataIC50:  67nM. Assay description: The inhibition of PDE 2A or 10 enzyme activity was assessed using IMAP-Phosphodiesterase-cAMP fluorescence labeled substrate (Molecular Devices, Orde...
Ligand InfoPC cidPC sid
In DepthDetails US Patent
TargetcAMP and cAMP-inhibited cGMP 3',5'-cyclic phosphodiesterase 10A(Homo sapiens (Human))
Boehringer Ingelheim International
US Patent
LigandPNGBDBM284741(US10023575, Example 32 | US10479794, Example 32 | ...)
Affinity DataIC50: >1.00E+4nM. Assay description: The inhibition of PDE 2A or 10 enzyme activity was assessed using IMAP-Phosphodiesterase-cAMP fluorescence labeled substrate (Molecular Devices, Orde...
Ligand InfoPC cidPC sid
In DepthDetails US Patent
TargetcGMP-dependent 3',5'-cyclic phosphodiesterase(Homo sapiens (Human))
Boehringer Ingelheim International
US Patent
LigandPNGBDBM284741(US10023575, Example 32 | US10479794, Example 32 | ...)
Affinity DataIC50:  67nM. Assay description: Assay Principle: The PDE reaction cleaves cAMP to AMP. The IMAP system (Molecular Device) using fluorescence polarization (FP) as detection principle...
Ligand InfoPC cidPC sid
In DepthDetails US Patent
TargetcAMP and cAMP-inhibited cGMP 3',5'-cyclic phosphodiesterase 10A(Homo sapiens (Human))
Boehringer Ingelheim International
US Patent
LigandPNGBDBM284741(US10023575, Example 32 | US10479794, Example 32 | ...)
Affinity DataIC50: >1.00E+4nM. Assay description: The inhibition of PDE 2A or 10 enzyme activity was assessed using IMAP-Phosphodiesterase-cAMP fluorescence labeled substrate (Molecular Devices, Orde...
Ligand InfoPC cidPC sid
In DepthDetails US Patent