BDBM284811 1-(4-(5-(4-Amino-5-(1-(tetrahydro-2H-pyran-4-yl)-1H-pyrazol-5-yl)pyrrolo[2,1-f][1,2,4]triazin-7-yl)pyridin-3-yl)piperazin-1-yl)ethanone, TFA::US10023576, Example 1
SMILES CC(=O)N1CCN(CC1)c1cncc(c1)-c1cc(-c2ccnn2C2CCOCC2)c2c(N)ncnn12
InChI Key InChIKey=ZRVNAAUXHTYULC-UHFFFAOYSA-N
Data  1 IC50
  Tab Delimited (TSV)   2D SDfile   Computed 3D by Vconf -m prep SDfile
Find this compound or compounds like it in BindingDB:
Activity Spreadsheet -- Enzyme Inhibition Constant Data from BindingDB
Found 1 hit for monomerid = 284811
TargetPhosphatidylinositol 4,5-bisphosphate 3-kinase catalytic subunit delta isoform(Homo sapiens (Human))
Bristol-Myers Squibb
US Patent
LigandPNGBDBM284811(1-(4-(5-(4-Amino-5-(1-(tetrahydro-2H-pyran-4-yl)-1...)
Affinity DataIC50:  5nMpH: 7.5 T: 2°C. Assay description: The ADP-Glo format PI3K assays were performed in Proxiplate 384-well plates (Perkin Elmer #6008280). The final assay volume was 2 μl prepared fr...
Ligand InfoPC cidPC sid
In DepthDetails US Patent