BDBM284813 5-(1-cyclohexyl-1H-pyrazol-5-yl)-7-(1-methyl- 1H-benzo[d]imidazol-6-yl)pyrrolo[2,1-f][1,2,4] triazin-4-amine::US10023576, Example 3
SMILES Cn1cnc2ccc(cc12)-c1cc(-c2ccnn2C2CCCCC2)c2c(N)ncnn12
InChI Key InChIKey=IGDRSWAIEJAIOH-UHFFFAOYSA-N
Data  1 IC50
  Tab Delimited (TSV)   2D SDfile   Computed 3D by Vconf -m prep SDfile
Find this compound or compounds like it in BindingDB:
Activity Spreadsheet -- Enzyme Inhibition Constant Data from BindingDB
Found 1 hit for monomerid = 284813
TargetPhosphatidylinositol 4,5-bisphosphate 3-kinase catalytic subunit delta isoform(Homo sapiens (Human))
Bristol-Myers Squibb
US Patent
LigandPNGBDBM284813(5-(1-cyclohexyl-1H-pyrazol-5-yl)-7-(1-methyl- 1H-b...)
Affinity DataIC50:  9nMpH: 7.5 T: 2°C. Assay description: The ADP-Glo format PI3K assays were performed in Proxiplate 384-well plates (Perkin Elmer #6008280). The final assay volume was 2 μl prepared fr...
Ligand InfoPC cidPC sid
In DepthDetails US Patent