BDBM284831 1-(4-(6-(4-amino-5-(1-(tetrahydro-2H-pyran-4-yl)-1H-1,2,3- triazol-5-yl)pyrrolo[2,1-f][1,2,4]triazin-7-yl)-1H-indazol-1- yl)piperidin-1-yl)ethanone::US10023576, Example 21
SMILES CC(=O)N1CCC(CC1)n1ncc2ccc(cc12)-c1cc(-c2cnnn2C2CCOCC2)c2c(N)ncnn12
InChI Key InChIKey=GKKDBYQIWOIGLK-UHFFFAOYSA-N
Data  1 IC50
  Tab Delimited (TSV)   2D SDfile   Computed 3D by Vconf -m prep SDfile
Find this compound or compounds like it in BindingDB:
Activity Spreadsheet -- Enzyme Inhibition Constant Data from BindingDB
Found 1 hit for monomerid = 284831
TargetPhosphatidylinositol 4,5-bisphosphate 3-kinase catalytic subunit delta isoform(Homo sapiens (Human))
Bristol-Myers Squibb
US Patent
LigandPNGBDBM284831(1-(4-(6-(4-amino-5-(1-(tetrahydro-2H-pyran-4-yl)-1...)
Affinity DataIC50:  1nMpH: 7.5 T: 2°C. Assay description: The ADP-Glo format PI3K assays were performed in Proxiplate 384-well plates (Perkin Elmer #6008280). The final assay volume was 2 μl prepared fr...
Ligand InfoPC cidPC sid
In DepthDetails US Patent