BDBM284852 7-(1-isopropyl-1H-indazol-6-yl)-5-(1-(tetrahydro-2H-pyran-4-yl)- 1H-pyrazol-5-yl)pyrrolo[2,1-f][1,2,4]triazin-4-amine::US10023576, Example 42
SMILES CC(C)n1ncc2ccc(cc12)-c1cc(-c2ccnn2C2CCOCC2)c2c(N)ncnn12
InChI Key InChIKey=XXFAJMNNCIBRQG-UHFFFAOYSA-N
Data  1 IC50
  Tab Delimited (TSV)   2D SDfile   Computed 3D by Vconf -m prep SDfile
Find this compound or compounds like it in BindingDB:
Activity Spreadsheet -- Enzyme Inhibition Constant Data from BindingDB
Found 1 hit for monomerid = 284852
TargetPhosphatidylinositol 4,5-bisphosphate 3-kinase catalytic subunit delta isoform(Homo sapiens (Human))
Bristol-Myers Squibb
US Patent
LigandPNGBDBM284852(7-(1-isopropyl-1H-indazol-6-yl)-5-(1-(tetrahydro-2...)
Affinity DataIC50:  8nMpH: 7.5 T: 2°C. Assay description: The ADP-Glo format PI3K assays were performed in Proxiplate 384-well plates (Perkin Elmer #6008280). The final assay volume was 2 μl prepared fr...
Ligand InfoPC cidPC sid
In DepthDetails US Patent